Repository navigation
ref(opentelemetry): Remove deprecated OpenTelemetry classes #13243
Annotations
11 errors and 6 notices
|
io.sentry.uitest.android.UserInteractionTests ► composableSwipeGeneratesMatchingBreadcrumb:
sentry-android-integration-tests/sentry-uitest-android/build/outputs/androidTest-results/connected/release/TEST-test(AVD) - 11.xml#L0
Failed test found in:
sentry-android-integration-tests/sentry-uitest-android/build/outputs/androidTest-results/connected/release/TEST-test(AVD) - 11.xml
Error:
org.junit.AssumptionViolatedException: got: <false>, expected: is <true>
|
|
io.sentry.uitest.android.UserInteractionTests ► composableClickGeneratesMatchingBreadcrumb:
sentry-android-integration-tests/sentry-uitest-android/build/outputs/androidTest-results/connected/release/TEST-test(AVD) - 11.xml#L0
Failed test found in:
sentry-android-integration-tests/sentry-uitest-android/build/outputs/androidTest-results/connected/release/TEST-test(AVD) - 11.xml
Error:
org.junit.AssumptionViolatedException: got: <false>, expected: is <true>
|
|
io.sentry.uitest.android.ReplayTest ► composeReplayDoesNotLeak:
sentry-android-integration-tests/sentry-uitest-android/build/outputs/androidTest-results/connected/release/TEST-test(AVD) - 11.xml#L0
Failed test found in:
sentry-android-integration-tests/sentry-uitest-android/build/outputs/androidTest-results/connected/release/TEST-test(AVD) - 11.xml
Error:
org.junit.AssumptionViolatedException: got: <false>, expected: is <true>
|
|
io.sentry.uitest.android.EnvelopeTests ► checkEnvelopeProfiledTransaction:
sentry-android-integration-tests/sentry-uitest-android/build/outputs/androidTest-results/connected/release/TEST-test(AVD) - 11.xml#L0
Failed test found in:
sentry-android-integration-tests/sentry-uitest-android/build/outputs/androidTest-results/connected/release/TEST-test(AVD) - 11.xml
Error:
org.junit.AssumptionViolatedException: got: <[null]>, expected: every item is not null
|
|
io.sentry.uitest.android.EnvelopeTests ► checkTimedOutProfile:
sentry-android-integration-tests/sentry-uitest-android/build/outputs/androidTest-results/connected/release/TEST-test(AVD) - 11.xml#L0
Failed test found in:
sentry-android-integration-tests/sentry-uitest-android/build/outputs/androidTest-results/connected/release/TEST-test(AVD) - 11.xml
Error:
org.junit.AssumptionViolatedException: Sometimes traceFile does not exist for profiles on emulators and it fails. Although, Android Runtime is the one that manages the file, so something must be wrong with Debug.startMethodTracing
|
|
io.sentry.uitest.android.AutomaticSpansTest ► checkAppStartFramesMeasurements:
sentry-android-integration-tests/sentry-uitest-android/build/outputs/androidTest-results/connected/release/TEST-test(AVD) - 11.xml#L0
Failed test found in:
sentry-android-integration-tests/sentry-uitest-android/build/outputs/androidTest-results/connected/release/TEST-test(AVD) - 11.xml
Error:
org.junit.AssumptionViolatedException: got: <false>, expected: is <true>
|
|
io.sentry.uitest.android.ReplayTest ► composeReplayDoesNotLeak:
sentry-android-integration-tests/sentry-uitest-android/build/outputs/androidTest-results/connected/release/TEST-test(AVD) - 11.xml#L0
Failed test found in:
sentry-android-integration-tests/sentry-uitest-android/build/outputs/androidTest-results/connected/release/TEST-test(AVD) - 11.xml
Error:
org.junit.AssumptionViolatedException: got: <false>, expected: is <true>
|
|
io.sentry.uitest.android.ReplaySnapshotTest ► captureComposeReplayFrameSnapshots:
sentry-android-integration-tests/sentry-uitest-android/build/outputs/androidTest-results/connected/release/TEST-test(AVD) - 11.xml#L0
Failed test found in:
sentry-android-integration-tests/sentry-uitest-android/build/outputs/androidTest-results/connected/release/TEST-test(AVD) - 11.xml
Error:
org.junit.AssumptionViolatedException: got: <false>, expected: is <true>
|
|
io.sentry.uitest.android.EnvelopeTests ► checkEnvelopeProfiledTransaction:
sentry-android-integration-tests/sentry-uitest-android/build/outputs/androidTest-results/connected/release/TEST-test(AVD) - 11.xml#L0
Failed test found in:
sentry-android-integration-tests/sentry-uitest-android/build/outputs/androidTest-results/connected/release/TEST-test(AVD) - 11.xml
Error:
org.junit.AssumptionViolatedException: got: <[null]>, expected: every item is not null
|
|
io.sentry.uitest.android.EnvelopeTests ► checkTimedOutProfile:
sentry-android-integration-tests/sentry-uitest-android/build/outputs/androidTest-results/connected/release/TEST-test(AVD) - 11.xml#L0
Failed test found in:
sentry-android-integration-tests/sentry-uitest-android/build/outputs/androidTest-results/connected/release/TEST-test(AVD) - 11.xml
Error:
org.junit.AssumptionViolatedException: Sometimes traceFile does not exist for profiles on emulators and it fails. Although, Android Runtime is the one that manages the file, so something must be wrong with Debug.startMethodTracing
|
|
io.sentry.uitest.android.AutomaticSpansTest ► checkAppStartFramesMeasurements:
sentry-android-integration-tests/sentry-uitest-android/build/outputs/androidTest-results/connected/release/TEST-test(AVD) - 11.xml#L0
Failed test found in:
sentry-android-integration-tests/sentry-uitest-android/build/outputs/androidTest-results/connected/release/TEST-test(AVD) - 11.xml
Error:
org.junit.AssumptionViolatedException: got: <false>, expected: is <true>
|
|
AGP Matrix Release - AGP 9.2.1 - Integrations false
"The ubuntu-latest label will migrate to Ubuntu 26 beginning October 19, 2026. For more information, see https://github.com/actions/runner-images/issues/14748"
|
|
AGP Matrix Release - AGP 9.4.0 - Integrations false
"The ubuntu-latest label will migrate to Ubuntu 26 beginning October 19, 2026. For more information, see https://github.com/actions/runner-images/issues/14748"
|
|
AGP Matrix Release - AGP 9.4.0 - Integrations true
"The ubuntu-latest label will migrate to Ubuntu 26 beginning October 19, 2026. For more information, see https://github.com/actions/runner-images/issues/14748"
|
|
AGP Matrix Release - AGP 9.0.0 - Integrations false
"The ubuntu-latest label will migrate to Ubuntu 26 beginning October 19, 2026. For more information, see https://github.com/actions/runner-images/issues/14748"
|
|
AGP Matrix Release - AGP 9.2.1 - Integrations true
"The ubuntu-latest label will migrate to Ubuntu 26 beginning October 19, 2026. For more information, see https://github.com/actions/runner-images/issues/14748"
|
|
AGP Matrix Release - AGP 9.0.0 - Integrations true
"The ubuntu-latest label will migrate to Ubuntu 26 beginning October 19, 2026. For more information, see https://github.com/actions/runner-images/issues/14748"
|
Artifacts
Produced during runtime
| Name | Size | Digest | |
|---|---|---|---|
|
test-results-AGP9.0.0-Integrationsfalse
|
7.17 MB |
sha256:80163509c7e365dfd0663182405f591fd63ff5d34ea41ae7987891ab806ba508
|
|
|
test-results-AGP9.0.0-Integrationstrue
|
7.3 MB |
sha256:a7e812eea32e6a301d23bd91361db500d37cdb26590858677682193446508701
|
|
|
test-results-AGP9.2.1-Integrationsfalse
|
19.1 MB |
sha256:008047031858649d12a73f0650c9a1e60399ed8385969462da8d316cdb465036
|
|
|
test-results-AGP9.2.1-Integrationstrue
|
19.4 MB |
sha256:180004806a6822ffb5e9b9df41bf9b4c0c58a5fc60412a39f169eb4b052d0a1a
|
|
|
test-results-AGP9.4.0-Integrationsfalse
|
19.4 MB |
sha256:7cfa1c1f94ece88eed4e14d18b058e1bd6c27bf8f9a6c9636adfd48505e3fc2a
|
|
|
test-results-AGP9.4.0-Integrationstrue
|
19.7 MB |
sha256:012322e55f8c45bdb80c853efd8055c320d6eb509baa17b5a523247eb049a990
|
|